Reaction Details
TargetAurora kinase A
LigandBDBM50053303
Substrate/Competitorn/a
Meas. Tech.ChEMBL_1458484 (CHEMBL3370370)
IC50 1820±n/a nM
Citation Song, DPark, YYoon, JAman, WHah, JMRyu, JS Click approach to the discovery of 1,2,3-triazolylsalicylamides as potent Aurora kinase inhibitors. Bioorg Med Chem22:4855-66 (2014) 
 
Aurora kinase A
Name:Aurora kinase A
Type:Serine/threonine-protein kinase
Mol. Mass.:45830.98
Organism:Homo sapiens (Human)
Description:O14965
Residue:403
BDBM50053303
NameBDBM50053303
Synonyms:CHEMBL3321770
TypeSmall organic molecule
Emp. Form.C24H17F3N4O4
Mol. Mass.482.4114
SMILESCOC(=O)c1cccc(c1)-c1cn(nn1)-c1ccc(O)c(c1)C(=O)Nc1cccc(c1)C(F)(F)F