Reaction Details
TargetAurora kinase B
LigandBDBM50053305
Substrate/Competitorn/a
Meas. Tech.ChEMBL_1459298 (CHEMBL3367528)
IC50 480±n/a nM
Citation Laufer, RNg, GLiu, YPatel, NKEdwards, LGLang, YLi, SWFeher, MAwrey, DELeung, GBeletskaya, IPlotnikova, OMason, JMHodgson, RWei, XMao, GLuo, XHuang, PGreen, EKiarash, RLin, DCHarris-Brandts, MBan, FNadeem, VMak, TWPan, GJQiu, WChirgadze, NYPauls, HW Discovery of inhibitors of the mitotic kinase TTK based on N-(3-(3-sulfamoylphenyl)-1H-indazol-5-yl)-acetamides and carboxamides. Bioorg Med Chem22:4968-97 (2014) 
 
Aurora kinase B
Name:Aurora kinase B
Type:Protein
Mol. Mass.:39327.72
Organism:Homo sapiens (Human)
Description:Q96GD4
Residue:344
BDBM50053305
NameBDBM50053305
Synonyms:CHEMBL3330409
TypeSmall organic molecule
Emp. Form.C25H27N5O3S
Mol. Mass.477.579
SMILESCCc1ccccc1C(N(C)C)C(=O)Nc1ccc2[nH]nc(-c3cccc(c3)S(N)(=O)=O)c2c1