Reaction Details
TargetSerine/threonine-protein kinase Chk2
LigandBDBM50053304
Substrate/Competitorn/a
Meas. Tech.ChEMBL_1459300 (CHEMBL3367530)
IC50 100±n/a nM
Citation Laufer, RNg, GLiu, YPatel, NKEdwards, LGLang, YLi, SWFeher, MAwrey, DELeung, GBeletskaya, IPlotnikova, OMason, JMHodgson, RWei, XMao, GLuo, XHuang, PGreen, EKiarash, RLin, DCHarris-Brandts, MBan, FNadeem, VMak, TWPan, GJQiu, WChirgadze, NYPauls, HW Discovery of inhibitors of the mitotic kinase TTK based on N-(3-(3-sulfamoylphenyl)-1H-indazol-5-yl)-acetamides and carboxamides. Bioorg Med Chem22:4968-97 (2014) 
 
Serine/threonine-protein kinase Chk2
Name:Serine/threonine-protein kinase Chk2
Type:Protein
Mol. Mass.:60908.59
Organism:Homo sapiens (Human)
Description:O96017
Residue:543
BDBM50053304
NameBDBM50053304
Synonyms:CHEMBL3330410
TypeSmall organic molecule
Emp. Form.C23H23N5O3S2
Mol. Mass.481.59
SMILESNS(=O)(=O)c1cccc(c1)-c1n[nH]c2ccc(NC(=O)C(N3CCCC3)c3ccsc3)cc12