Reaction Details
TargetDual specificity protein kinase TTK
LigandBDBM50053313
Substrate/Competitorn/a
Meas. Tech.ChEMBL_1458487 (CHEMBL3370373)
IC50 17000±n/a nM
Citation Laufer, RNg, GLiu, YPatel, NKEdwards, LGLang, YLi, SWFeher, MAwrey, DELeung, GBeletskaya, IPlotnikova, OMason, JMHodgson, RWei, XMao, GLuo, XHuang, PGreen, EKiarash, RLin, DCHarris-Brandts, MBan, FNadeem, VMak, TWPan, GJQiu, WChirgadze, NYPauls, HW Discovery of inhibitors of the mitotic kinase TTK based on N-(3-(3-sulfamoylphenyl)-1H-indazol-5-yl)-acetamides and carboxamides. Bioorg Med Chem22:4968-97 (2014) 
 
Dual specificity protein kinase TTK
Name:Dual specificity protein kinase TTK
Type:Protein
Mol. Mass.:97086.79
Organism:Homo sapiens (Human)
Description:P33981
Residue:857
BDBM50053313
NameBDBM50053313
Synonyms:CHEMBL3330241 | US11370770, Compound 6h
TypeSmall organic molecule
Emp. Form.C14H10ClN3O
Mol. Mass.271.702
SMILESNC(=O)c1cccc(c1)-c1n[nH]c2cccc(Cl)c12