Reaction Details
TargetDual specificity protein kinase TTK
LigandBDBM50053331
Substrate/Competitorn/a
Meas. Tech.ChEMBL_1458488 (CHEMBL3370374)
IC50 330±n/a nM
Citation Laufer, RNg, GLiu, YPatel, NKEdwards, LGLang, YLi, SWFeher, MAwrey, DELeung, GBeletskaya, IPlotnikova, OMason, JMHodgson, RWei, XMao, GLuo, XHuang, PGreen, EKiarash, RLin, DCHarris-Brandts, MBan, FNadeem, VMak, TWPan, GJQiu, WChirgadze, NYPauls, HW Discovery of inhibitors of the mitotic kinase TTK based on N-(3-(3-sulfamoylphenyl)-1H-indazol-5-yl)-acetamides and carboxamides. Bioorg Med Chem22:4968-97 (2014) 
 
Dual specificity protein kinase TTK
Name:Dual specificity protein kinase TTK
Type:Protein
Mol. Mass.:97086.79
Organism:Homo sapiens (Human)
Description:P33981
Residue:857
BDBM50053331
NameBDBM50053331
Synonyms:CHEMBL3330258
TypeSmall organic molecule
Emp. Form.C21H20N4O4S2
Mol. Mass.456.538
SMILESCc1cccc(CS(=O)(=O)Nc2ccc3[nH]nc(-c4cccc(c4)S(N)(=O)=O)c3c2)c1