Reaction Details
TargetDual specificity protein kinase TTK
LigandBDBM50053360
Substrate/Competitorn/a
Meas. Tech.ChEMBL_1458488 (CHEMBL3370374)
IC50 24±n/a nM
Citation Laufer, RNg, GLiu, YPatel, NKEdwards, LGLang, YLi, SWFeher, MAwrey, DELeung, GBeletskaya, IPlotnikova, OMason, JMHodgson, RWei, XMao, GLuo, XHuang, PGreen, EKiarash, RLin, DCHarris-Brandts, MBan, FNadeem, VMak, TWPan, GJQiu, WChirgadze, NYPauls, HW Discovery of inhibitors of the mitotic kinase TTK based on N-(3-(3-sulfamoylphenyl)-1H-indazol-5-yl)-acetamides and carboxamides. Bioorg Med Chem22:4968-97 (2014) 
 
Dual specificity protein kinase TTK
Name:Dual specificity protein kinase TTK
Type:Protein
Mol. Mass.:97086.79
Organism:Homo sapiens (Human)
Description:P33981
Residue:857
BDBM50053360
NameBDBM50053360
Synonyms:CHEMBL3330279
TypeSmall organic molecule
Emp. Form.C23H22N4O3S
Mol. Mass.434.511
SMILESCCC(C(=O)Nc1ccc2[nH]nc(-c3cccc(c3)S(N)(=O)=O)c2c1)c1ccccc1