Reaction Details
TargetHexokinase-4
LigandBDBM50053951
Substrate/Competitorn/a
Meas. Tech.ChEMBL_1455573 (CHEMBL3364950)
EC50 510±n/a nM
Citation Hong, FTNorman, MHAshton, KSBartberger, MDChen, JChmait, SCupples, RFotsch, CJordan, SRLloyd, DJSivits, GTadesse, SHale, CSt Jean, DJ Small molecule disruptors of the glucokinase-glucokinase regulatory protein interaction: 4. Exploration of a novel binding pocket. J Med Chem57:5949-64 (2014) 
 
Hexokinase-4
Name:Hexokinase-4
Type:Enzyme
Mol. Mass.:52075.40
Organism:Mus musculus (Mouse)
Description:P52792
Residue:465
BDBM50053951
NameBDBM50053951
Synonyms:CHEMBL3319528
TypeSmall organic molecule
Emp. Form.C20H19F6N5O4S
Mol. Mass.539.451
SMILESNc1ccc(cn1)S(=O)(=O)N1CCN(CC1)c1ncc(cc1C#CCO)C(O)(C(F)(F)F)C(F)(F)F