Reaction Details
TargetHexokinase-4
LigandBDBM50053966
Substrate/Competitorn/a
Meas. Tech.ChEMBL_1455572 (CHEMBL3364949)
IC50 20±n/a nM
Citation Hong, FTNorman, MHAshton, KSBartberger, MDChen, JChmait, SCupples, RFotsch, CJordan, SRLloyd, DJSivits, GTadesse, SHale, CSt Jean, DJ Small molecule disruptors of the glucokinase-glucokinase regulatory protein interaction: 4. Exploration of a novel binding pocket. J Med Chem57:5949-64 (2014) 
 
Hexokinase-4
Name:Hexokinase-4
Type:Enzyme
Mol. Mass.:52175.81
Organism:Homo sapiens (Human)
Description:P35557
Residue:465
BDBM50053966
NameBDBM50053966
Synonyms:CHEMBL3319560
TypeSmall organic molecule
Emp. Form.C26H24F6N6O4S
Mol. Mass.630.562
SMILESCN1C(=O)Cc2cc(ccc12)-c1cc(cnc1N1CCN(CC1)S(=O)(=O)c1ccc(N)nc1)C(O)(C(F)(F)F)C(F)(F)F