Reaction Details
TargetHexokinase-4
LigandBDBM50053977
Substrate/Competitorn/a
Meas. Tech.ChEMBL_1455573 (CHEMBL3364950)
EC50 1400±n/a nM
Citation Hong, FTNorman, MHAshton, KSBartberger, MDChen, JChmait, SCupples, RFotsch, CJordan, SRLloyd, DJSivits, GTadesse, SHale, CSt Jean, DJ Small molecule disruptors of the glucokinase-glucokinase regulatory protein interaction: 4. Exploration of a novel binding pocket. J Med Chem57:5949-64 (2014) 
 
Hexokinase-4
Name:Hexokinase-4
Type:Enzyme
Mol. Mass.:52075.40
Organism:Mus musculus (Mouse)
Description:P52792
Residue:465
BDBM50053977
NameBDBM50053977
Synonyms:CHEMBL3319555
TypeSmall organic molecule
Emp. Form.C23H22F6N6O4S
Mol. Mass.592.514
SMILESCOc1cncc(c1)-c1cc(cnc1N1CCN(CC1)S(=O)(=O)c1ccc(N)nc1)C(O)(C(F)(F)F)C(F)(F)F