Reaction Details
TargetHexokinase-4
LigandBDBM50053982
Substrate/Competitorn/a
Meas. Tech.ChEMBL_1455573 (CHEMBL3364950)
EC50 794±n/a nM
Citation Hong, FTNorman, MHAshton, KSBartberger, MDChen, JChmait, SCupples, RFotsch, CJordan, SRLloyd, DJSivits, GTadesse, SHale, CSt Jean, DJ Small molecule disruptors of the glucokinase-glucokinase regulatory protein interaction: 4. Exploration of a novel binding pocket. J Med Chem57:5949-64 (2014) 
 
Hexokinase-4
Name:Hexokinase-4
Type:Enzyme
Mol. Mass.:52075.40
Organism:Mus musculus (Mouse)
Description:P52792
Residue:465
BDBM50053982
NameBDBM50053982
Synonyms:CHEMBL3319552
TypeSmall organic molecule
Emp. Form.C23H22F6N6O3S
Mol. Mass.576.515
SMILESCc1cncc(c1)-c1cc(cnc1N1CCN(CC1)S(=O)(=O)c1ccc(N)nc1)C(O)(C(F)(F)F)C(F)(F)F