Reaction Details
TargetGlutathione S-transferase A1
LigandBDBM50054198
Substrate/Competitorn/a
Meas. Tech.ChEMBL_1458318 (CHEMBL3369280)
Ki 360±n/a nM
Citation Perperopoulou, FDTsoungas, PGThireou, TNRinotas, VEDouni, EKEliopoulos, EELabrou, NEClonis, YD 2,2'-Dihydroxybenzophenones and their carbonyl N-analogues as inhibitor scaffolds for MDR-involved human glutathione transferase isoenzyme A1-1. Bioorg Med Chem22:3957-70 (2014) 
 
Glutathione S-transferase A1
Name:Glutathione S-transferase A1
Type:Enzyme
Mol. Mass.:25636.31
Organism:Homo sapiens (Human)
Description:Glutathione-S-Transferase (GST, N-terminally)
Residue:222
BDBM50054198
NameBDBM50054198
Synonyms:CHEMBL3310888
TypeSmall organic molecule
Emp. Form.C13H9BrO3
Mol. Mass.293.113
SMILESOc1ccccc1C(=O)c1cc(Br)ccc1O