Reaction Details
TargetCarbonic anhydrase 2
LigandBDBM50054648
Substrate/Competitorn/a
Meas. Tech.ChEMBL_1453079 (CHEMBL3362528)
Ki 3.5±n/a nM
Citation Pichake, JKharkar, PSCeruso, MSupuran, CTToraskar, MP Carbonic anhydrase inhibitors: design, synthesis, and biological evaluation of novel sulfonyl semicarbazide derivatives. ACS Med Chem Lett5:793-6 (2014) 
 
Carbonic anhydrase 2
Name:Carbonic anhydrase 2
Type:Enzyme
Mol. Mass.:29250.71
Organism:Homo sapiens (Human)
Description:P00918
Residue:260
BDBM50054648
NameBDBM50054648
Synonyms:CHEMBL3323207
TypeSmall organic molecule
Emp. Form.C13H13ClN4O5S2
Mol. Mass.404.849
SMILESNS(=O)(=O)c1ccc(NC(=O)NNS(=O)(=O)c2ccc(Cl)cc2)cc1