Reaction Details
TargetCarbonic anhydrase 1
LigandBDBM50054651
Substrate/Competitorn/a
Meas. Tech.ChEMBL_1453078 (CHEMBL3362527)
Ki 41±n/a nM
Citation Pichake, JKharkar, PSCeruso, MSupuran, CTToraskar, MP Carbonic anhydrase inhibitors: design, synthesis, and biological evaluation of novel sulfonyl semicarbazide derivatives. ACS Med Chem Lett5:793-6 (2014) 
 
Carbonic anhydrase 1
Name:Carbonic anhydrase 1
Type:Enzyme
Mol. Mass.:28873.37
Organism:Homo sapiens (Human)
Description:P00915
Residue:261
BDBM50054651
NameBDBM50054651
Synonyms:CHEMBL3323213
TypeSmall organic molecule
Emp. Form.C15H17N5O6S2
Mol. Mass.427.455
SMILESCC(=O)Nc1ccc(cc1)S(=O)(=O)NNC(=O)Nc1ccc(cc1)S(N)(=O)=O