Reaction Details
TargetCarbonic anhydrase 9
LigandBDBM50054653
Substrate/Competitorn/a
Meas. Tech.ChEMBL_1453080 (CHEMBL3362529)
Ki 39±n/a nM
Citation Pichake, JKharkar, PSCeruso, MSupuran, CTToraskar, MP Carbonic anhydrase inhibitors: design, synthesis, and biological evaluation of novel sulfonyl semicarbazide derivatives. ACS Med Chem Lett5:793-6 (2014) 
 
Carbonic anhydrase 9
Name:Carbonic anhydrase 9
Type:Enzyme
Mol. Mass.:49669.03
Organism:Homo sapiens (Human)
Description:Catalytic domain of human cloned isozyme was used in the assay
Residue:459
BDBM50054653
NameBDBM50054653
Synonyms:CHEMBL3323211
TypeSmall organic molecule
Emp. Form.C13H12ClN5O7S2
Mol. Mass.449.847
SMILESNS(=O)(=O)c1ccc(NC(=O)NNS(=O)(=O)c2ccc(Cl)c(c2)[N+]([O-])=O)cc1