Reaction Details
TargetCarbonic anhydrase 9
LigandBDBM50054652
Substrate/Competitorn/a
Meas. Tech.ChEMBL_1453080 (CHEMBL3362529)
Ki 80±n/a nM
Citation Pichake, JKharkar, PSCeruso, MSupuran, CTToraskar, MP Carbonic anhydrase inhibitors: design, synthesis, and biological evaluation of novel sulfonyl semicarbazide derivatives. ACS Med Chem Lett5:793-6 (2014) 
 
Carbonic anhydrase 9
Name:Carbonic anhydrase 9
Type:Enzyme
Mol. Mass.:49669.03
Organism:Homo sapiens (Human)
Description:Catalytic domain of human cloned isozyme was used in the assay
Residue:459
BDBM50054652
NameBDBM50054652
Synonyms:CHEMBL3323212
TypeSmall organic molecule
Emp. Form.C14H16N4O6S2
Mol. Mass.400.43
SMILESCOc1ccc(cc1)S(=O)(=O)NNC(=O)Nc1ccc(cc1)S(N)(=O)=O