Reaction Details
TargetCannabinoid receptor 2
LigandBDBM50055267
Substrate/Competitorn/a
Meas. Tech.ChEMBL_1450475 (CHEMBL3379971)
EC50 45±n/a nM
Citation Brizzi, AAiello, FMarini, PCascio, MGCorelli, FBrizzi, VDe Petrocellis, LLigresti, ALuongo, LLamponi, SMaione, SPertwee, RGDi Marzo, V Structure-affinity relationships and pharmacological characterization of new alkyl-resorcinol cannabinoid receptor ligands: Identification of a dual cannabinoid receptor/TRPA1 channel agonist. Bioorg Med Chem22:4770-83 (2014) 
 
Cannabinoid receptor 2
Name:Cannabinoid receptor 2
Type:G Protein-Coupled Receptor (GPCR)
Mol. Mass.:39690.94
Organism:Homo sapiens (Human)
Description:P34972
Residue:360
BDBM50055267
NameBDBM50055267
Synonyms:CHEMBL3323682
TypeSmall organic molecule
Emp. Form.C26H43NO3
Mol. Mass.417.6245
SMILESCCCCCCC(C)(C)c1cc(O)cc(OCCCCCCCC(=O)NCC=C)c1