Reaction Details
TargetCannabinoid receptor 2
LigandBDBM50055434
Substrate/Competitorn/a
Meas. Tech.ChEMBL_1450470 (CHEMBL3379966)
Ki 678±n/a nM
Citation Brizzi, AAiello, FMarini, PCascio, MGCorelli, FBrizzi, VDe Petrocellis, LLigresti, ALuongo, LLamponi, SMaione, SPertwee, RGDi Marzo, V Structure-affinity relationships and pharmacological characterization of new alkyl-resorcinol cannabinoid receptor ligands: Identification of a dual cannabinoid receptor/TRPA1 channel agonist. Bioorg Med Chem22:4770-83 (2014) 
 
Cannabinoid receptor 2
Name:Cannabinoid receptor 2
Type:G Protein-Coupled Receptor (GPCR)
Mol. Mass.:39690.94
Organism:Homo sapiens (Human)
Description:P34972
Residue:360
BDBM50055434
NameBDBM50055434
Synonyms:CHEMBL3323693
TypeSmall organic molecule
Emp. Form.C27H46N2O3
Mol. Mass.446.6657
SMILESCCCCCc1cc(O)cc(OCCCCCCCCCCC(=O)NN2CCCCC2)c1