Reaction Details
TargetCannabinoid receptor 1
LigandBDBM50055283
Substrate/Competitorn/a
Meas. Tech.ChEMBL_1450469 (CHEMBL3379965)
Ki>10000±n/a nM
Citation Brizzi, AAiello, FMarini, PCascio, MGCorelli, FBrizzi, VDe Petrocellis, LLigresti, ALuongo, LLamponi, SMaione, SPertwee, RGDi Marzo, V Structure-affinity relationships and pharmacological characterization of new alkyl-resorcinol cannabinoid receptor ligands: Identification of a dual cannabinoid receptor/TRPA1 channel agonist. Bioorg Med Chem22:4770-83 (2014) 
 
Cannabinoid receptor 1
Name:Cannabinoid receptor 1
Type:G Protein-Coupled Receptor (GPCR)
Mol. Mass.:52868.96
Organism:Homo sapiens (Human)
Description:P21554
Residue:472
BDBM50055283
NameBDBM50055283
Synonyms:CHEMBL3323685
TypeSmall organic molecule
Emp. Form.C28H41NO3
Mol. Mass.439.63
SMILESCCCCCc1cc(O)cc(OCCCCCCCCCCC(=O)Nc2ccccc2)c1