Reaction Details
TargetCannabinoid receptor 1
LigandBDBM50055458
Substrate/Competitorn/a
Meas. Tech.ChEMBL_1450469 (CHEMBL3379965)
Ki>10000±n/a nM
Citation Brizzi, AAiello, FMarini, PCascio, MGCorelli, FBrizzi, VDe Petrocellis, LLigresti, ALuongo, LLamponi, SMaione, SPertwee, RGDi Marzo, V Structure-affinity relationships and pharmacological characterization of new alkyl-resorcinol cannabinoid receptor ligands: Identification of a dual cannabinoid receptor/TRPA1 channel agonist. Bioorg Med Chem22:4770-83 (2014) 
 
Cannabinoid receptor 1
Name:Cannabinoid receptor 1
Type:G Protein-Coupled Receptor (GPCR)
Mol. Mass.:52868.96
Organism:Homo sapiens (Human)
Description:P21554
Residue:472
BDBM50055458
NameBDBM50055458
Synonyms:CHEMBL3323676
TypeSmall organic molecule
Emp. Form.C25H43NO5
Mol. Mass.437.6126
SMILESCCCCCc1cc(O)cc(OCCCCCCCCCCC(=O)NC(CO)CO)c1