Reaction Details
TargetCannabinoid receptor 1
LigandBDBM50055462
Substrate/Competitorn/a
Meas. Tech.ChEMBL_1450469 (CHEMBL3379965)
Ki 264±n/a nM
Citation Brizzi, AAiello, FMarini, PCascio, MGCorelli, FBrizzi, VDe Petrocellis, LLigresti, ALuongo, LLamponi, SMaione, SPertwee, RGDi Marzo, V Structure-affinity relationships and pharmacological characterization of new alkyl-resorcinol cannabinoid receptor ligands: Identification of a dual cannabinoid receptor/TRPA1 channel agonist. Bioorg Med Chem22:4770-83 (2014) 
 
Cannabinoid receptor 1
Name:Cannabinoid receptor 1
Type:G Protein-Coupled Receptor (GPCR)
Mol. Mass.:52868.96
Organism:Homo sapiens (Human)
Description:P21554
Residue:472
BDBM50055462
NameBDBM50055462
Synonyms:CHEMBL3323673
TypeSmall organic molecule
Emp. Form.C25H43NO4
Mol. Mass.421.6132
SMILESCCCCCc1cc(O)cc(OCCCCCCCCCCC(=O)N[C@H](C)CO)c1