Reaction Details
TargetReceptor-type tyrosine-protein kinase FLT3
LigandBDBM50055498
Substrate/Competitorn/a
Meas. Tech.ChEMBL_1451318 (CHEMBL3363337)
IC50 1.2±n/a nM
Citation Zhang, WDeRyckere, DHunter, DLiu, JStashko, MAMinson, KACummings, CTLee, MGlaros, TGNewton, DLSather, SZhang, DKireev, DJanzen, WPEarp, HSGraham, DKFrye, SVWang, X UNC2025, a potent and orally bioavailable MER/FLT3 dual inhibitor. J Med Chem57:7031-41 (2014) 
 
Receptor-type tyrosine-protein kinase FLT3
Name:Receptor-type tyrosine-protein kinase FLT3
Type:Enzyme
Mol. Mass.:112888.62
Organism:Homo sapiens (Human)
Description:P36888
Residue:993
BDBM50055498
NameBDBM50055498
Synonyms:CHEMBL3326004 US9795606, B28
TypeSmall organic molecule
Emp. Form.C27H37FN6O3S
Mol. Mass.544.684
SMILESCCCCNc1ncc2c(cn([C@H]3CC[C@H](O)CC3)c2n1)-c1ccc(c(F)c1)S(=O)(=O)N1CCN(C)CC1