Reaction Details
TargetTyrosine-protein kinase Mer
LigandBDBM50055490
Substrate/Competitorn/a
Meas. Tech.ChEMBL_1451317 (CHEMBL3363336)
IC50 1.3±n/a nM
Citation Zhang, WDeRyckere, DHunter, DLiu, JStashko, MAMinson, KACummings, CTLee, MGlaros, TGNewton, DLSather, SZhang, DKireev, DJanzen, WPEarp, HSGraham, DKFrye, SVWang, X UNC2025, a potent and orally bioavailable MER/FLT3 dual inhibitor. J Med Chem57:7031-41 (2014) 
 
Tyrosine-protein kinase Mer
Name:Tyrosine-protein kinase Mer
Type:PROTEIN
Mol. Mass.:110234.77
Organism:Homo sapiens (Human)
Description:ChEMBL_1498723
Residue:999
BDBM50055490
NameBDBM50055490
Synonyms:CHEMBL3326007
TypeSmall organic molecule
Emp. Form.C29H40N6O
Mol. Mass.488.6675
SMILESCN1CCN(Cc2ccc(cc2)-c2cn([C@H]3CC[C@H](O)CC3)c3nc(NCCC4CC4)ncc23)CC1