Reaction Details
TargetTyrosine-protein kinase Mer
LigandBDBM50055496
Substrate/Competitorn/a
Meas. Tech.ChEMBL_1451317 (CHEMBL3363336)
IC50 0.740000±n/a nM
Citation Zhang, WDeRyckere, DHunter, DLiu, JStashko, MAMinson, KACummings, CTLee, MGlaros, TGNewton, DLSather, SZhang, DKireev, DJanzen, WPEarp, HSGraham, DKFrye, SVWang, X UNC2025, a potent and orally bioavailable MER/FLT3 dual inhibitor. J Med Chem57:7031-41 (2014) 
 
Tyrosine-protein kinase Mer
Name:Tyrosine-protein kinase Mer
Type:PROTEIN
Mol. Mass.:110234.77
Organism:Homo sapiens (Human)
Description:ChEMBL_1498723
Residue:999
BDBM50055496
NameBDBM50055496
Synonyms:CHEMBL3326006
TypeSmall organic molecule
Emp. Form.C28H40N6O
Mol. Mass.476.6568
SMILESCCCCNc1ncc2c(cn([C@H]3CC[C@H](O)CC3)c2n1)-c1ccc(CN2CCN(C)CC2)cc1