Reaction Details
TargetCannabinoid receptor 1
LigandBDBM50055565
Substrate/Competitorn/a
Meas. Tech.ChEMBL_1453154 (CHEMBL3364788)
Ki 1100±n/a nM
Citation Rosati, OMessina, FPelosi, ACurini, MPetrucci, VGertsch, JChicca, A One-pot heterogeneous synthesis of¿(3)-tetrahydrocannabinol analogues and xanthenes showing differential binding to CB(1) and CB(2) receptors. Eur J Med Chem85:77-86 (2014) 
 
Cannabinoid receptor 1
Name:Cannabinoid receptor 1
Type:G Protein-Coupled Receptor (GPCR)
Mol. Mass.:52868.96
Organism:Homo sapiens (Human)
Description:P21554
Residue:472
BDBM50055565
NameBDBM50055565
Synonyms:CHEMBL3329481
TypeSmall organic molecule
Emp. Form.C21H30O2
Mol. Mass.314.4617
SMILESCCCCCc1cc(O)c2c(OC3=C(CC[C@@H](C)C3)C2(C)C)c1