Reaction Details
TargetCannabinoid receptor 2
LigandBDBM50055566
Substrate/Competitorn/a
Meas. Tech.ChEMBL_1453155 (CHEMBL3364789)
Ki 1000±n/a nM
Citation Rosati, OMessina, FPelosi, ACurini, MPetrucci, VGertsch, JChicca, A One-pot heterogeneous synthesis of¿(3)-tetrahydrocannabinol analogues and xanthenes showing differential binding to CB(1) and CB(2) receptors. Eur J Med Chem85:77-86 (2014) 
 
Cannabinoid receptor 2
Name:Cannabinoid receptor 2
Type:G Protein-Coupled Receptor (GPCR)
Mol. Mass.:39690.94
Organism:Homo sapiens (Human)
Description:P34972
Residue:360
BDBM50055566
NameBDBM50055566
Synonyms:CHEMBL3329482
TypeSmall organic molecule
Emp. Form.C17H22O2
Mol. Mass.258.3554
SMILESC[C@@H]1CCC2=C(C1)Oc1c(C)c(O)ccc1C2(C)C