Reaction Details
TargetCannabinoid receptor 1
LigandBDBM50056318
Substrate/Competitorn/a
Meas. Tech.ChEMBL_1449782 (CHEMBL3378769)
EC50 3890±n/a nM
Citation Huang, GPemp, DStadtmüller, PNimczick, MHeilmann, JDecker, M Design, synthesis and in vitro evaluation of novel uni- and bivalent ligands for the cannabinoid receptor type 1 with variation of spacer length and structure. Bioorg Med Chem Lett24:4209-14 (2014) 
 
Cannabinoid receptor 1
Name:Cannabinoid receptor 1
Type:G Protein-Coupled Receptor (GPCR)
Mol. Mass.:52868.96
Organism:Homo sapiens (Human)
Description:P21554
Residue:472
BDBM50056318
NameBDBM50056318
Synonyms:CHEMBL3322350
TypeSmall organic molecule
Emp. Form.C55H57Cl6N7O2
Mol. Mass.1060.805
SMILESCc1c(nn(c1-c1ccc(Cl)cc1)-c1ccc(Cl)cc1Cl)C(=O)NCCCCCCCN(CCCCCCCNC(=O)c1nn(c(c1C)-c1ccc(Cl)cc1)-c1ccc(Cl)cc1Cl)Cc1ccccc1