Reaction Details
TargetCannabinoid receptor 1
LigandBDBM50056341
Substrate/Competitorn/a
Meas. Tech.ChEMBL_1449782 (CHEMBL3378769)
EC50 1905±n/a nM
Citation Huang, GPemp, DStadtmüller, PNimczick, MHeilmann, JDecker, M Design, synthesis and in vitro evaluation of novel uni- and bivalent ligands for the cannabinoid receptor type 1 with variation of spacer length and structure. Bioorg Med Chem Lett24:4209-14 (2014) 
 
Cannabinoid receptor 1
Name:Cannabinoid receptor 1
Type:G Protein-Coupled Receptor (GPCR)
Mol. Mass.:52868.96
Organism:Homo sapiens (Human)
Description:P21554
Residue:472
BDBM50056341
NameBDBM50056341
Synonyms:CHEMBL3322479
TypeSmall organic molecule
Emp. Form.C50H46Cl6N8O3
Mol. Mass.1019.67
SMILESCc1c(nn(c1-c1ccc(Cl)cc1)-c1ccc(Cl)cc1Cl)C(=O)NCCCCNCc1ccc(cc1)C(=O)NCCCCNC(=O)c1nn(c(c1C)-c1ccc(Cl)cc1)-c1ccc(Cl)cc1Cl