Reaction Details
Target2'-deoxynucleoside 5'-phosphate N-hydrolase 1
LigandBDBM50056955
Substrate/Competitorn/a
Meas. Tech.ChEMBL_1455848 (CHEMBL3362302)
Ki 2300±n/a nM
Citation Amiable, CPaoletti, JHaouz, APadilla, ALabesse, GKaminski, PAPochet, S 6-(Hetero)Arylpurine nucleotides as inhibitors of the oncogenic target DNPH1: synthesis, structural studies and cytotoxic activities. Eur J Med Chem85:418-37 (2014) 
 
2'-deoxynucleoside 5'-phosphate N-hydrolase 1
Name:2'-deoxynucleoside 5'-phosphate N-hydrolase 1
Type:Enzyme
Mol. Mass.:17775.23
Organism:Rattus norvegicus (Rat)
Description:O35820
Residue:163
BDBM50056955
NameBDBM50056955
Synonyms:CHEMBL3356090
TypeSmall organic molecule
Emp. Form.C28H23N4O7PS
Mol. Mass.590.544
SMILESO[C@@H]1[C@@H](COP(O)(O)=O)O[C@H]([C@@H]1O)n1cnc2c(ncnc12)-c1cccc(c1)-c1cccc2c3ccccc3sc12