Reaction Details
Target2'-deoxynucleoside 5'-phosphate N-hydrolase 1
LigandBDBM50056954
Substrate/Competitorn/a
Meas. Tech.ChEMBL_1455848 (CHEMBL3362302)
Ki 1600±n/a nM
Citation Amiable, CPaoletti, JHaouz, APadilla, ALabesse, GKaminski, PAPochet, S 6-(Hetero)Arylpurine nucleotides as inhibitors of the oncogenic target DNPH1: synthesis, structural studies and cytotoxic activities. Eur J Med Chem85:418-37 (2014) 
 
2'-deoxynucleoside 5'-phosphate N-hydrolase 1
Name:2'-deoxynucleoside 5'-phosphate N-hydrolase 1
Type:Enzyme
Mol. Mass.:17775.23
Organism:Rattus norvegicus (Rat)
Description:O35820
Residue:163
BDBM50056954
NameBDBM50056954
Synonyms:CHEMBL3331381
TypeSmall organic molecule
Emp. Form.C27H25N4O8P
Mol. Mass.564.4832
SMILESCOc1ccc2cc(ccc2c1)-c1cccc(c1)-c1ncnc2n(cnc12)[C@@H]1O[C@H](COP(O)(O)=O)[C@@H](O)[C@H]1O