Reaction Details
Target2'-deoxynucleoside 5'-phosphate N-hydrolase 1
LigandBDBM50056957
Substrate/Competitorn/a
Meas. Tech.ChEMBL_1455849 (CHEMBL3362303)
Ki 1300±n/a nM
Citation Amiable, CPaoletti, JHaouz, APadilla, ALabesse, GKaminski, PAPochet, S 6-(Hetero)Arylpurine nucleotides as inhibitors of the oncogenic target DNPH1: synthesis, structural studies and cytotoxic activities. Eur J Med Chem85:418-37 (2014) 
 
2'-deoxynucleoside 5'-phosphate N-hydrolase 1
Name:2'-deoxynucleoside 5'-phosphate N-hydrolase 1
Type:PROTEIN
Mol. Mass.:19102.16
Organism:Homo sapiens (Human)
Description:ChEMBL_109542
Residue:174
BDBM50056957
NameBDBM50056957
Synonyms:CHEMBL3331375
TypeSmall organic molecule
Emp. Form.C14H14ClN4O7PS
Mol. Mass.448.775
SMILESO[C@@H]1[C@@H](COP(O)(O)=O)O[C@H]([C@@H]1O)n1cnc2c(ncnc12)-c1ccc(Cl)s1