Reaction Details
TargetcAMP-specific 3',5'-cyclic phosphodiesterase 4D
LigandBDBM50057791
Substrate/Competitorn/a
Meas. Tech.ChEMBL_1450581 (CHEMBL3372159)
IC50 660±n/a nM
Citation Brullo, CMassa, MRocca, MRotolo, CGuariento, SRivera, DRicciarelli, RFedele, EFossa, PBruno, O Synthesis, biological evaluation, and molecular modeling of new 3-(cyclopentyloxy)-4-methoxybenzaldehyde O-(2-(2,6-dimethylmorpholino)-2-oxoethyl) Oxime (GEBR-7b) related phosphodiesterase 4D (PDE4D) inhibitors. J Med Chem57:7061-72 (2014) 
 
cAMP-specific 3',5'-cyclic phosphodiesterase 4D
Name:cAMP-specific 3',5'-cyclic phosphodiesterase 4D
Type:Protein
Mol. Mass.:91092.69
Organism:Homo sapiens (Human)
Description:Q08499
Residue:809
BDBM50057791
NameBDBM50057791
Synonyms:CHEMBL3326083
TypeSmall organic molecule
Emp. Form.C17H24N2O3
Mol. Mass.304.3841
SMILESCOc1ccc(\C=N\N2CCOCC2)cc1OC1CCCC1