Reaction Details
TargetcAMP-specific 3',5'-cyclic phosphodiesterase 4B
LigandBDBM50057791
Substrate/Competitorn/a
Meas. Tech.ChEMBL_1450582 (CHEMBL3372160)
IC50 1600±n/a nM
Citation Brullo, CMassa, MRocca, MRotolo, CGuariento, SRivera, DRicciarelli, RFedele, EFossa, PBruno, O Synthesis, biological evaluation, and molecular modeling of new 3-(cyclopentyloxy)-4-methoxybenzaldehyde O-(2-(2,6-dimethylmorpholino)-2-oxoethyl) Oxime (GEBR-7b) related phosphodiesterase 4D (PDE4D) inhibitors. J Med Chem57:7061-72 (2014) 
 
cAMP-specific 3',5'-cyclic phosphodiesterase 4B
Name:cAMP-specific 3',5'-cyclic phosphodiesterase 4B
Type:Protein
Mol. Mass.:83318.87
Organism:Homo sapiens (Human)
Description:Q07343
Residue:736
BDBM50057791
NameBDBM50057791
Synonyms:CHEMBL3326083
TypeSmall organic molecule
Emp. Form.C17H24N2O3
Mol. Mass.304.3841
SMILESCOc1ccc(\C=N\N2CCOCC2)cc1OC1CCCC1