Reaction Details
Target5-hydroxytryptamine receptor 7
LigandBDBM50058313
Substrate/Competitorn/a
Meas. Tech.ChEMBL_1456828 (CHEMBL3367561)
Ki 3.0±n/a nM
Citation Salerno, LPittalą, VModica, MNSiracusa, MAIntagliata, SCagnotto, ASalmona, MKurczab, RBojarski, AJRomeo, G Structure-activity relationships and molecular modeling studies of novel arylpiperazinylalkyl 2-benzoxazolones and 2-benzothiazolones as 5-HT(7) and 5-HT(1A) receptor ligands. Eur J Med Chem85:716-26 (2014) 
 
5-hydroxytryptamine receptor 7
Name:5-hydroxytryptamine receptor 7
Type:G Protein-Coupled Receptor (GPCR)
Mol. Mass.:53573.08
Organism:Homo sapiens (Human)
Description:P34969
Residue:479
BDBM50058313
NameBDBM50058313
Synonyms:CHEMBL3331385
TypeSmall organic molecule
Emp. Form.C23H29N3OS
Mol. Mass.395.561
SMILESO=c1sc2ccccc2n1CCCCCCN1CCN(CC1)c1ccccc1