Reaction Details
Target5-hydroxytryptamine receptor 1A
LigandBDBM50058310
Substrate/Competitorn/a
Meas. Tech.ChEMBL_1456829 (CHEMBL3367562)
Ki 0.430000±n/a nM
Citation Salerno, LPittalą, VModica, MNSiracusa, MAIntagliata, SCagnotto, ASalmona, MKurczab, RBojarski, AJRomeo, G Structure-activity relationships and molecular modeling studies of novel arylpiperazinylalkyl 2-benzoxazolones and 2-benzothiazolones as 5-HT(7) and 5-HT(1A) receptor ligands. Eur J Med Chem85:716-26 (2014) 
 
5-hydroxytryptamine receptor 1A
Name:5-hydroxytryptamine receptor 1A
Type:n/a
Mol. Mass.:46122.49
Organism:Homo sapiens (Human)
Description:n/a
Residue:422
BDBM50058310
NameBDBM50058310
Synonyms:CHEMBL3331387
TypeSmall organic molecule
Emp. Form.C24H31N3O2S
Mol. Mass.425.587
SMILESCOc1ccccc1N1CCN(CCCCCCn2c3ccccc3sc2=O)CC1