Reaction Details
TargetPotassium voltage-gated channel subfamily H member 2
LigandBDBM50058431
Substrate/Competitorn/a
Meas. Tech.ChEMBL_1459565 (CHEMBL3369365)
Ki>10000±n/a nM
Citation Kormos, CMGichinga, MGMaitra, RRunyon, SPThomas, JBBrieaddy, LEMascarella, SWNavarro, HACarroll, FI Design, synthesis, and biological evaluation of (3R)-1,2,3,4-tetrahydro-7-hydroxy-N-[(1S)-1-[[(3R,4R)-4-(3-hydroxyphenyl)-3,4-dimethyl-1-piperidinyl]methyl]-2-methylpropyl]-3-isoquinolinecarboxamide (JDTic) analogues: in vitro pharmacology and ADME profile. J Med Chem57:7367-81 (2014) 
 
Potassium voltage-gated channel subfamily H member 2
Name:Potassium voltage-gated channel subfamily H member 2
Type:Multi-pass membrane protein
Mol. Mass.:126672.65
Organism:Homo sapiens (Human)
Description:Q12809
Residue:1159
BDBM50058431
NameBDBM50058431
Synonyms:CHEMBL3326795
TypeSmall organic molecule
Emp. Form.C30H41N3O3
Mol. Mass.491.6648
SMILESCC(C)[C@@H](CN1CC[C@](C)([C@@H](C)C1)c1cccc(c1)C(N)=O)CC(=O)[C@H]1Cc2ccc(O)cc2CN1