Reaction Details
TargetCannabinoid receptor 2
LigandBDBM50058434
Substrate/Competitorn/a
Meas. Tech.ChEMBL_1459580 (CHEMBL3369615)
Ki 38±n/a nM
Citation Pinna, GCurzu, MMDore, ALazzari, PRuiu, SPau, AMurineddu, GPinna, GA Tricyclic pyrazoles part 7. Discovery of potent and selective dihydrothienocyclopentapyrazole derived CB2 ligands. Eur J Med Chem85:747-57 (2014) 
 
Cannabinoid receptor 2
Name:Cannabinoid receptor 2
Type:Enzyme Catalytic Domain
Mol. Mass.:38220.43
Organism:MOUSE
Description:P47936
Residue:347
BDBM50058434
NameBDBM50058434
Synonyms:CHEMBL3331462
TypeSmall organic molecule
Emp. Form.C20H18Cl2N4OS
Mol. Mass.433.354
SMILESCc1cc-2c(Cc3c(nn(c-23)-c2ccc(Cl)cc2Cl)C(=O)NN2CCCC2)s1