Reaction Details
TargetCannabinoid receptor 2
LigandBDBM50058502
Substrate/Competitorn/a
Meas. Tech.ChEMBL_1459580 (CHEMBL3369615)
Ki 6.7±n/a nM
Citation Pinna, GCurzu, MMDore, ALazzari, PRuiu, SPau, AMurineddu, GPinna, GA Tricyclic pyrazoles part 7. Discovery of potent and selective dihydrothienocyclopentapyrazole derived CB2 ligands. Eur J Med Chem85:747-57 (2014) 
 
Cannabinoid receptor 2
Name:Cannabinoid receptor 2
Type:Enzyme Catalytic Domain
Mol. Mass.:38220.43
Organism:MOUSE
Description:P47936
Residue:347
BDBM50058502
NameBDBM50058502
Synonyms:CHEMBL3331454
TypeSmall organic molecule
Emp. Form.C26H29Cl2N3OS
Mol. Mass.502.499
SMILESCC(C)[C@H]1CC[C@H](C)CC1NC(=O)c1nn(c-2c1Cc1scc(C)c-21)-c1ccc(Cl)cc1Cl