Reaction Details
TargetMitogen-activated protein kinase kinase kinase kinase 4
LigandBDBM50058514
Substrate/Competitorn/a
Meas. Tech.ChEMBL_1448973 (CHEMBL3376320)
IC50 1600±n/a nM
Citation Wang, LStanley, MBoggs, JWCrawford, TDBravo, BJGiannetti, AMHarris, SFMagnuson, SRNonomiya, JSchmidt, SWu, PYe, WGould, SEMurray, LJNdubaku, COChen, H Fragment-based identification and optimization of a class of potent pyrrolo[2,1-f][1,2,4]triazine MAP4K4 inhibitors. Bioorg Med Chem Lett24:4546-52 (2014) 
 
Mitogen-activated protein kinase kinase kinase kinase 4
Name:Mitogen-activated protein kinase kinase kinase kinase 4
Type:Serine/threonine-protein kinase
Mol. Mass.:142114.73
Organism:Homo sapiens (Human)
Description:O95819
Residue:1239
BDBM50058514
NameBDBM50058514
Synonyms:CHEMBL3326655
TypeSmall organic molecule
Emp. Form.C11H9N5
Mol. Mass.211.2227
SMILESN(c1ccncc1)c1ncnn2cccc12