Reaction Details
TargetMitogen-activated protein kinase kinase kinase kinase 4
LigandBDBM50058662
Substrate/Competitorn/a
Meas. Tech.ChEMBL_1448973 (CHEMBL3376320)
IC50 1000±n/a nM
Citation Wang, LStanley, MBoggs, JWCrawford, TDBravo, BJGiannetti, AMHarris, SFMagnuson, SRNonomiya, JSchmidt, SWu, PYe, WGould, SEMurray, LJNdubaku, COChen, H Fragment-based identification and optimization of a class of potent pyrrolo[2,1-f][1,2,4]triazine MAP4K4 inhibitors. Bioorg Med Chem Lett24:4546-52 (2014) 
 
Mitogen-activated protein kinase kinase kinase kinase 4
Name:Mitogen-activated protein kinase kinase kinase kinase 4
Type:Serine/threonine-protein kinase
Mol. Mass.:142114.73
Organism:Homo sapiens (Human)
Description:O95819
Residue:1239
BDBM50058662
NameBDBM50058662
Synonyms:CHEMBL3326764
TypeSmall organic molecule
Emp. Form.C22H23N7
Mol. Mass.385.4649
SMILESCN1CCN(CC1)c1ccc(cc1)-c1cc2c(Nc3ccncc3)ncnn2c1