Reaction Details
TargetMitogen-activated protein kinase kinase kinase kinase 4
LigandBDBM50058668
Substrate/Competitorn/a
Meas. Tech.ChEMBL_1448973 (CHEMBL3376320)
IC50 1000±n/a nM
Citation Wang, LStanley, MBoggs, JWCrawford, TDBravo, BJGiannetti, AMHarris, SFMagnuson, SRNonomiya, JSchmidt, SWu, PYe, WGould, SEMurray, LJNdubaku, COChen, H Fragment-based identification and optimization of a class of potent pyrrolo[2,1-f][1,2,4]triazine MAP4K4 inhibitors. Bioorg Med Chem Lett24:4546-52 (2014) 
 
Mitogen-activated protein kinase kinase kinase kinase 4
Name:Mitogen-activated protein kinase kinase kinase kinase 4
Type:Serine/threonine-protein kinase
Mol. Mass.:142114.73
Organism:Homo sapiens (Human)
Description:O95819
Residue:1239
BDBM50058668
NameBDBM50058668
Synonyms:CHEMBL3326760
TypeSmall organic molecule
Emp. Form.C20H20N6
Mol. Mass.344.413
SMILESCN(C)Cc1ccc(cc1)-c1cc2c(Nc3ccncc3)ncnn2c1