Reaction Details
TargetCarbonic anhydrase 2
LigandBDBM50058823
Substrate/Competitorn/a
Meas. Tech.ChEMBL_1452411 (CHEMBL3362073)
Ki 1110±n/a nM
Citation Schwarz, SSommerwerk, SLucas, SDHeller, LCsuk, R Sulfamates of methyl triterpenoates are effective and competitive inhibitors of carbonic anhydrase II. Eur J Med Chem86:95-102 (2014) 
 
Carbonic anhydrase 2
Name:Carbonic anhydrase 2
Type:Enzyme Catalytic Domain
Mol. Mass.:29115.93
Organism:Bos taurus
Description:n/a
Residue:260
BDBM50058823
NameBDBM50058823
Synonyms:CHEMBL3325726
TypeSmall organic molecule
Emp. Form.C31H51NO5S
Mol. Mass.549.805
SMILES[H][C@@]12CC[C@]3(C)[C@]([H])(CC=C4[C@]5([H])[C@@H](C)[C@H](C)CC[C@@]5(CC[C@@]34C)C(=O)OC)[C@@]1(C)CC[C@H](OS(N)(=O)=O)C2(C)C