Reaction Details
TargetInosine-5'-monophosphate dehydrogenase
LigandBDBM50100958
Substrate/Competitorn/a
Meas. Tech.ChEMBL_1452432 (CHEMBL3362456)
Ki 48±n/a nM
Citation Mandapati, KGorla, SKHouse, ALMcKenney, ESZhang, MRao, SNGollapalli, DRMann, BJGoldberg, JBCuny, GDGlomski, IJHedstrom, L Repurposing cryptosporidium inosine 5'-monophosphate dehydrogenase inhibitors as potential antibacterial agents. ACS Med Chem Lett5:846-50 (2014) 
 
Inosine-5'-monophosphate dehydrogenase
Name:Inosine-5'-monophosphate dehydrogenase
Type:PROTEIN
Mol. Mass.:52375.32
Organism:Bacillus anthracis
Description:ChEMBL_109471
Residue:487
BDBM50100958
NameBDBM50100958
Synonyms:CHEMBL3329562
TypeSmall organic molecule
Emp. Form.C18H20BrN3O2
Mol. Mass.390.274
SMILESC\C(=N/O)c1cccc(c1)C(C)(C)NC(=O)Nc1ccc(Br)cc1