Reaction Details
TargetInosine-5'-monophosphate dehydrogenase
LigandBDBM81428
Substrate/Competitorn/a
Meas. Tech.ChEMBL_1452447 (CHEMBL3362471)
Ki 14±n/a nM
Citation Mandapati, KGorla, SKHouse, ALMcKenney, ESZhang, MRao, SNGollapalli, DRMann, BJGoldberg, JBCuny, GDGlomski, IJHedstrom, L Repurposing cryptosporidium inosine 5'-monophosphate dehydrogenase inhibitors as potential antibacterial agents. ACS Med Chem Lett5:846-50 (2014) 
 
Inosine-5'-monophosphate dehydrogenase
Name:Inosine-5'-monophosphate dehydrogenase
Type:Protein
Mol. Mass.:43076.80
Organism:Cryptosporidium parvum
Description:Q8T6T2
Residue:400
BDBM81428
NameBDBM81428
Synonyms:N-(naphthalen-2-yl)-2-[2-(pyridin-2-yl)-1H-1,3-benzodiazol-1-yl]acetamide, Compound C91
TypeSmall organic molecule
Emp. Form.C24H18N4O
Mol. Mass.378.4259
SMILESO=C(Cn1c(nc2ccccc12)-c1ccccn1)Nc1ccc2ccccc2c1