Reaction Details
TargetInosine-5'-monophosphate dehydrogenase
LigandBDBM50432791
Substrate/Competitorn/a
Meas. Tech.ChEMBL_1452448 (CHEMBL3362472)
Ki 17±n/a nM
Citation Mandapati, KGorla, SKHouse, ALMcKenney, ESZhang, MRao, SNGollapalli, DRMann, BJGoldberg, JBCuny, GDGlomski, IJHedstrom, L Repurposing cryptosporidium inosine 5'-monophosphate dehydrogenase inhibitors as potential antibacterial agents. ACS Med Chem Lett5:846-50 (2014) 
 
Inosine-5'-monophosphate dehydrogenase
Name:Inosine-5'-monophosphate dehydrogenase
Type:PROTEIN
Mol. Mass.:52375.32
Organism:Bacillus anthracis
Description:ChEMBL_109471
Residue:487
BDBM50432791
NameBDBM50432791
Synonyms:CHEMBL2348823
TypeSmall organic molecule
Emp. Form.C25H19N3O3
Mol. Mass.409.4367
SMILESC[C@H](Oc1cccc2ccccc12)C(=O)Nc1ccc2oc(nc2c1)-c1ccncc1