Reaction Details
TargetCarbonic anhydrase 2
LigandBDBM50262063
Substrate/Competitorn/a
Meas. Tech.ChEMBL_1456925 (CHEMBL3368142)
Ki 176±n/a nM
Citation Pala, NMicheletto, LSechi, MAggarwal, MCarta, FMcKenna, RSupuran, CT Carbonic Anhydrase Inhibition with Benzenesulfonamides and Tetrafluorobenzenesulfonamides Obtained via Click Chemistry. ACS Med Chem Lett5:927-30 (2014) 
 
Carbonic anhydrase 2
Name:Carbonic anhydrase 2
Type:Enzyme
Mol. Mass.:29250.71
Organism:Homo sapiens (Human)
Description:P00918
Residue:260
BDBM50262063
NameBDBM50262063
Synonyms:4-(4-p-tolyl-1H-1,2,3-triazol-1-yl)benzenesulfonamide | CHEMBL469220
TypeSmall organic molecule
Emp. Form.C15H14N4O2S
Mol. Mass.314.362
SMILESCc1ccc(cc1)-c1cn(nn1)-c1ccc(cc1)S(N)(=O)=O