Reaction Details
TargetCarbonic anhydrase 1
LigandBDBM50058939
Substrate/Competitorn/a
Meas. Tech.ChEMBL_1456924 (CHEMBL3368141)
Ki 45±n/a nM
Citation Pala, NMicheletto, LSechi, MAggarwal, MCarta, FMcKenna, RSupuran, CT Carbonic Anhydrase Inhibition with Benzenesulfonamides and Tetrafluorobenzenesulfonamides Obtained via Click Chemistry. ACS Med Chem Lett5:927-30 (2014) 
 
Carbonic anhydrase 1
Name:Carbonic anhydrase 1
Type:Enzyme
Mol. Mass.:28873.37
Organism:Homo sapiens (Human)
Description:P00915
Residue:261
BDBM50058939
NameBDBM50058939
Synonyms:CHEMBL3326418
TypeSmall organic molecule
Emp. Form.C14H15F4N5O4S
Mol. Mass.425.359
SMILESCC(C)(C)OC(=O)NCc1cn(nn1)-c1c(F)c(F)c(c(F)c1F)S(N)(=O)=O