Reaction Details
TargetCarbonic anhydrase 9
LigandBDBM50059068
Substrate/Competitorn/a
Meas. Tech.ChEMBL_1456926 (CHEMBL3368143)
Ki 5.3±n/a nM
Citation Pala, NMicheletto, LSechi, MAggarwal, MCarta, FMcKenna, RSupuran, CT Carbonic Anhydrase Inhibition with Benzenesulfonamides and Tetrafluorobenzenesulfonamides Obtained via Click Chemistry. ACS Med Chem Lett5:927-30 (2014) 
 
Carbonic anhydrase 9
Name:Carbonic anhydrase 9
Type:Enzyme
Mol. Mass.:49669.03
Organism:Homo sapiens (Human)
Description:Catalytic domain of human cloned isozyme was used in the assay
Residue:459
BDBM50059068
NameBDBM50059068
Synonyms:CHEMBL3326413
TypeSmall organic molecule
Emp. Form.C10H7BrF4N4O2S
Mol. Mass.403.151
SMILESNS(=O)(=O)c1c(F)c(F)c(c(F)c1F)-n1cc(CCBr)nn1