Reaction Details
TargetCarbonic anhydrase 12
LigandBDBM50059071
Substrate/Competitorn/a
Meas. Tech.ChEMBL_1456927 (CHEMBL3368144)
Ki 59±n/a nM
Citation Pala, NMicheletto, LSechi, MAggarwal, MCarta, FMcKenna, RSupuran, CT Carbonic Anhydrase Inhibition with Benzenesulfonamides and Tetrafluorobenzenesulfonamides Obtained via Click Chemistry. ACS Med Chem Lett5:927-30 (2014) 
 
Carbonic anhydrase 12
Name:Carbonic anhydrase 12
Type:Enzyme
Mol. Mass.:39456.00
Organism:Homo sapiens (Human)
Description:Catalytic domain of human cloned isozyme was used in the assay
Residue:354
BDBM50059071
NameBDBM50059071
Synonyms:CHEMBL3326416
TypeSmall organic molecule
Emp. Form.C10H6F4N4O4S
Mol. Mass.354.238
SMILESCOC(=O)c1cn(nn1)-c1c(F)c(F)c(c(F)c1F)S(N)(=O)=O