Reaction Details
TargetCarbonic anhydrase 1
LigandBDBM50058940
Substrate/Competitorn/a
Meas. Tech.ChEMBL_1456924 (CHEMBL3368141)
Ki 42±n/a nM
Citation Pala, NMicheletto, LSechi, MAggarwal, MCarta, FMcKenna, RSupuran, CT Carbonic Anhydrase Inhibition with Benzenesulfonamides and Tetrafluorobenzenesulfonamides Obtained via Click Chemistry. ACS Med Chem Lett5:927-30 (2014) 
 
Carbonic anhydrase 1
Name:Carbonic anhydrase 1
Type:Enzyme
Mol. Mass.:28873.37
Organism:Homo sapiens (Human)
Description:P00915
Residue:261
BDBM50058940
NameBDBM50058940
Synonyms:CHEMBL3326410
TypeSmall organic molecule
Emp. Form.C14H8F4N4O2S
Mol. Mass.372.298
SMILESNS(=O)(=O)c1c(F)c(F)c(c(F)c1F)-n1cc(nn1)-c1ccccc1