Reaction Details
TargetCarbonic anhydrase 1
LigandBDBM15233
Substrate/Competitorn/a
Meas. Tech.ChEMBL_1456924 (CHEMBL3368141)
Ki 873±n/a nM
Citation Pala, NMicheletto, LSechi, MAggarwal, MCarta, FMcKenna, RSupuran, CT Carbonic Anhydrase Inhibition with Benzenesulfonamides and Tetrafluorobenzenesulfonamides Obtained via Click Chemistry. ACS Med Chem Lett5:927-30 (2014) 
 
Carbonic anhydrase 1
Name:Carbonic anhydrase 1
Type:Enzyme
Mol. Mass.:28873.37
Organism:Homo sapiens (Human)
Description:P00915
Residue:261
BDBM15233
NameBDBM15233
Synonyms:4-[4-(hydroxymethyl)-1H-1,2,3-triazol-1-yl]benzene-1-sulfonamide benzene sulfonamide 17
TypeSmall organic molecule
Emp. Form.C9H10N4O3S
Mol. Mass.254.266
SMILESNS(=O)(=O)c1ccc(cc1)-n1cc(CO)nn1